Gambas 2 on Suse 9.1 doesn't compile

classic Classic list List threaded Threaded
3 messages Options
Reply | Threaded
Open this post in threaded view
|  
Report Content as Inappropriate

Gambas 2 on Suse 9.1 doesn't compile

Rolf-Werner Eilert
Hi folks, I was just curious to try Gambas 2, but on my Suse 9.1
configure produces this error

THESE COMPONENTS ARE DISABLED:

- gb.db.mysql
- gb.db.odbc
- gb.db.postgresql
- gb.db.sqlite
- gb.db.sqlite3
- gb.gtk
- gb.net.curl
- gb.sdl
- gb.sdl.opengl

and when I start make, it will stop after a minute saying

  gcc -DHAVE_CONFIG_H -I. -I. -I.. -pipe -Wall -fno-strict-aliasing
-Wno-unused-value -g -Os -MT regexp.lo -MD -MP -MF .deps/regexp.Tpo -c
regexp.c  -fPIC -DPIC -o .libs/regexp.o
regexp.c:368: error: `PCRE_ERROR_BADUTF8_OFFSET' undeclared here (not in
a function)
regexp.c:368: error: initializer element is not constant
regexp.c:368: error: (near initialization for `CRegexpDesc[29].val2')
regexp.c:368: error: initializer element is not constant
regexp.c:368: error: (near initialization for `CRegexpDesc[29]')
regexp.c:370: error: initializer element is not constant
regexp.c:370: error: (near initialization for `CRegexpDesc[30]')
regexp.c:371: error: initializer element is not constant
regexp.c:371: error: (near initialization for `CRegexpDesc[31]')
regexp.c:372: error: initializer element is not constant
regexp.c:372: error: (near initialization for `CRegexpDesc[32]')
regexp.c:374: error: initializer element is not constant
regexp.c:374: error: (near initialization for `CRegexpDesc[33]')
make[4]: *** [regexp.lo] Fehler 1
make[4]: Leaving directory
`/home/tester/Downloads/gambas2/gambas2-1.9.20/gb.pcre/src'
make[3]: *** [all-recursive] Fehler 1
make[3]: Leaving directory
`/home/tester/Downloads/gambas2/gambas2-1.9.20/gb.pcre'
make[2]: *** [all] Fehler 2
make[2]: Leaving directory
`/home/tester/Downloads/gambas2/gambas2-1.9.20/gb.pcre'
make[1]: *** [all-recursive] Fehler 1
make[1]: Leaving directory `/home/tester/Downloads/gambas2/gambas2-1.9.20'
make: *** [all] Fehler 2


Is there a chance to make it run on my system?

Regards
Rolf



-------------------------------------------------------
SF.Net email is sponsored by:
Tame your development challenges with Apache's Geronimo App Server.
Download it for free - -and be entered to win a 42" plasma tv or your very
own Sony(tm)PSP.  Click here to play: http://sourceforge.net/geronimo.php
_______________________________________________
Gambas-user mailing list
[hidden email]
https://lists.sourceforge.net/lists/listinfo/gambas-user
Reply | Threaded
Open this post in threaded view
|  
Report Content as Inappropriate

RE: Gambas 2 on Suse 9.1 doesn't compile

Peski -
I think that you haven't a lot of necessary dependencies. On my system (suse
9.3) I (and some people) only can't use gtk, sqlite and postgresql
components (I don't know the cause), but the rest you should can use without
problems if you have neccessary files installed.

Regards,
Francisco J. M?rquez (aka Peski)

>From: Eilert <[hidden email]>
>Reply-To: [hidden email]
>To: [hidden email]
>Subject: [Gambas-user] Gambas 2 on Suse 9.1 doesn't compile
>Date: Thu, 22 Sep 2005 15:41:22 +0200
>
>Hi folks, I was just curious to try Gambas 2, but on my Suse 9.1 configure
>produces this error
>
>THESE COMPONENTS ARE DISABLED:
>
>- gb.db.mysql
>- gb.db.odbc
>- gb.db.postgresql
>- gb.db.sqlite
>- gb.db.sqlite3
>- gb.gtk
>- gb.net.curl
>- gb.sdl
>- gb.sdl.opengl
>
>and when I start make, it will stop after a minute saying
>
>  gcc -DHAVE_CONFIG_H -I. -I. -I.. -pipe -Wall -fno-strict-aliasing
>-Wno-unused-value -g -Os -MT regexp.lo -MD -MP -MF .deps/regexp.Tpo -c
>regexp.c  -fPIC -DPIC -o .libs/regexp.o
>regexp.c:368: error: `PCRE_ERROR_BADUTF8_OFFSET' undeclared here (not in a
>function)
>regexp.c:368: error: initializer element is not constant
>regexp.c:368: error: (near initialization for `CRegexpDesc[29].val2')
>regexp.c:368: error: initializer element is not constant
>regexp.c:368: error: (near initialization for `CRegexpDesc[29]')
>regexp.c:370: error: initializer element is not constant
>regexp.c:370: error: (near initialization for `CRegexpDesc[30]')
>regexp.c:371: error: initializer element is not constant
>regexp.c:371: error: (near initialization for `CRegexpDesc[31]')
>regexp.c:372: error: initializer element is not constant
>regexp.c:372: error: (near initialization for `CRegexpDesc[32]')
>regexp.c:374: error: initializer element is not constant
>regexp.c:374: error: (near initialization for `CRegexpDesc[33]')
>make[4]: *** [regexp.lo] Fehler 1
>make[4]: Leaving directory
>`/home/tester/Downloads/gambas2/gambas2-1.9.20/gb.pcre/src'
>make[3]: *** [all-recursive] Fehler 1
>make[3]: Leaving directory
>`/home/tester/Downloads/gambas2/gambas2-1.9.20/gb.pcre'
>make[2]: *** [all] Fehler 2
>make[2]: Leaving directory
>`/home/tester/Downloads/gambas2/gambas2-1.9.20/gb.pcre'
>make[1]: *** [all-recursive] Fehler 1
>make[1]: Leaving directory `/home/tester/Downloads/gambas2/gambas2-1.9.20'
>make: *** [all] Fehler 2
>
>
>Is there a chance to make it run on my system?
>
>Regards
>Rolf
>
>
>
>-------------------------------------------------------
>SF.Net email is sponsored by:
>Tame your development challenges with Apache's Geronimo App Server.
>Download it for free - -and be entered to win a 42" plasma tv or your very
>own Sony(tm)PSP.  Click here to play: http://sourceforge.net/geronimo.php
>_______________________________________________
>Gambas-user mailing list
>[hidden email]
>https://lists.sourceforge.net/lists/listinfo/gambas-user




-------------------------------------------------------
SF.Net email is sponsored by:
Tame your development challenges with Apache's Geronimo App Server.
Download it for free - -and be entered to win a 42" plasma tv or your very
own Sony(tm)PSP.  Click here to play: http://sourceforge.net/geronimo.php
_______________________________________________
Gambas-user mailing list
[hidden email]
https://lists.sourceforge.net/lists/listinfo/gambas-user
Reply | Threaded
Open this post in threaded view
|  
Report Content as Inappropriate

Re: RE: Gambas 2 on Suse 9.1 doesn't compile

danielcampos
In reply to this post by Rolf-Werner Eilert
Hola:

>Te quería preguntar si tienes ya alguna forma de pasar la documentación del
>antiguo wiki al nuevo. Yo ya estoy registrado desde hace un tiempo.

Finalmente las cosas han cambiado (o están cambiando mucho) de la 1.0 a la 2.0, por lo que no voy a automatizar el paso de documentación. La mejor solución que he visto es ir tomando del antiguo a mano cosas, y si coinciden con lo que hay en el nuevo, meterlas allí. Si no coinciden, hay que reescribirlas. Por otra parte el nuevo formato me ha resultado muy dificil de adaptar automáticamente desde el de gnulinex (basado en Squeak)... así que, malas noticias, hay que ir haciéndolo a mano... :-((

>PD: ¿Cómo va el desarrollo de Gambas? La última versión que usé fue la
>1.9.14 pero ahora estoy instalando la 1.9.20, y veo que está un poco más
>parado el desarrollo que durante el verano. ¿Estáis arreglando cosas o
>simplemente es que estáis más ocupados?

Un poco de las dos cosas, pero si miras, por ejemplo la última versión de gb.gtk (http://gambas.gnulinex.org/gtk), verás que he metido bastantes cosas nuevas.

Saludos

Daniel

-------------------------------------------------------------
NetCourrier, votre bureau virtuel sur Internet : Mail, Agenda, Clubs, Toolbar...
Web/Wap : www.netcourrier.com
Téléphone/Fax : 08 92 69 00 21 (0,34 € TTC/min)
Minitel: 3615 NETCOURRIER (0,16 € TTC/min)



-------------------------------------------------------
SF.Net email is sponsored by:
Tame your development challenges with Apache's Geronimo App Server.
Download it for free - -and be entered to win a 42" plasma tv or your very
own Sony(tm)PSP.  Click here to play: http://sourceforge.net/geronimo.php
_______________________________________________
Gambas-user mailing list
[hidden email]
https://lists.sourceforge.net/lists/listinfo/gambas-user
Loading...